Build #81

Build: #81 failed Changes by Bob Hanson

Build result summary

Details

Completed
Duration
21 minutes
Labels
None
Agent
Default Agent
Revision
0f37bef750da116377ac662316d2e41abbd1a697 0f37bef750da116377ac662316d2e41abbd1a697
Total tests
1361
Failing since
#80 (Changes by Bob Hanson)

Responsible

Code commits

Author Commit Message Commit date
Bob Hanson Bob Hanson 0f37bef750da116377ac662316d2e41abbd1a697 0f37bef750da116377ac662316d2e41abbd1a697 JAL-3210 new transpiler fixes problem that it could have a null-pointer exception for comparison to history, where, apparently, IProject.getProject().getLocation() is null.

Tests

New test failures 1
Status Test View job Duration
Collapse Failed AlignFrameTest testColourThresholdActions History
Default Job < 1 sec
Classname: java.lang.AssertionError
Message: expected [java.awt.Color[r=196,g=186,b=196]] but found [java.awt.Color[r=138,g=117,b=138]]
Stacktrace:
java.lang.AssertionError: expected [java.awt.Color[r=196,g=186,b=196]] but found [java.awt.Color[r=138,g=117,b=138]]
	at org.testng.Assert.fail(Assert.java:94)
	at org.testng.Assert.failNotEquals(Assert.java:496)
	at org.testng.Assert.assertEquals(Assert.java:125)
	at org.testng.Assert.assertEquals(Assert.java:167)
(25 more lines...)
Existing test failures 7
Status Test Failing since View job Duration
Classname: java.lang.NullPointerException
Message: null
Stacktrace:
java.lang.NullPointerException
	at jalview.analysis.CrossRefTest.__CLR4_2_16yj49432kw(CrossRefTest.java:535)
	at jalview.analysis.CrossRefTest.testFindXrefSequences_forGeneAndTranscripts(CrossRefTest.java:469)
	at sun.reflect.NativeMethodAccessorImpl.invoke0(Native Method)
	at sun.reflect.NativeMethodAccessorImpl.invoke(NativeMethodAccessorImpl.java:62)
(21 more lines...)
Classname: java.lang.NullPointerException
Message: null
Stacktrace:
java.lang.NullPointerException
	at jalview.analysis.CrossRefTest.__CLR4_2_1ruxmrc32ka(CrossRefTest.java:452)
	at jalview.analysis.CrossRefTest.testFindXrefSequences_withFetch(CrossRefTest.java:415)
	at sun.reflect.NativeMethodAccessorImpl.invoke0(Native Method)
	at sun.reflect.NativeMethodAccessorImpl.invoke(NativeMethodAccessorImpl.java:62)
(21 more lines...)
Classname: java.lang.NullPointerException
Message: null
Stacktrace:
java.lang.NullPointerException
	at jalview.analysis.CrossRefTest.__CLR4_2_1nurnsm32ln(CrossRefTest.java:712)
	at jalview.analysis.CrossRefTest.testFindXrefSequences_uniprotEmblManyToMany(CrossRefTest.java:566)
	at sun.reflect.NativeMethodAccessorImpl.invoke0(Native Method)
	at sun.reflect.NativeMethodAccessorImpl.invoke(NativeMethodAccessorImpl.java:62)
(21 more lines...)
Classname: java.lang.AssertionError
Message: expected [19] but found [17]
Stacktrace:
java.lang.AssertionError: expected [19] but found [17]
	at org.testng.Assert.fail(Assert.java:94)
	at org.testng.Assert.failNotEquals(Assert.java:496)
	at org.testng.Assert.assertEquals(Assert.java:125)
	at org.testng.Assert.assertEquals(Assert.java:372)
(26 more lines...)
Classname: java.lang.AssertionError
Message: expected [19] but found [17]
Stacktrace:
java.lang.AssertionError: expected [19] but found [17]
	at org.testng.Assert.fail(Assert.java:94)
	at org.testng.Assert.failNotEquals(Assert.java:496)
	at org.testng.Assert.assertEquals(Assert.java:125)
	at org.testng.Assert.assertEquals(Assert.java:372)
(26 more lines...)
Classname: java.lang.AssertionError
Message: expected [19] but found [17]
Stacktrace:
java.lang.AssertionError: expected [19] but found [17]
	at org.testng.Assert.fail(Assert.java:94)
	at org.testng.Assert.failNotEquals(Assert.java:496)
	at org.testng.Assert.assertEquals(Assert.java:125)
	at org.testng.Assert.assertEquals(Assert.java:372)
(26 more lines...)
Classname: java.lang.AssertionError
Message: Expected only two mappings for 1A70 expected [2] but found [0]
Stacktrace:
java.lang.AssertionError: Expected only two mappings for 1A70 expected [2] but found [0]
	at org.testng.Assert.fail(Assert.java:94)
	at org.testng.Assert.failNotEquals(Assert.java:496)
	at org.testng.Assert.assertEquals(Assert.java:125)
	at org.testng.Assert.assertEquals(Assert.java:372)
(25 more lines...)

JIRA issues

IssueDescriptionStatus
Unknown Issue TypeJAL-3210Could not obtain issue details from JIRA

Shared artifacts

Artifact File size
jalview-jars 32 MB