Build #9

Build: #9 failed Child of JB-GDB304-10

Build result summary

Details

Completed
Duration
38 seconds
Labels
None
Agent
Default Agent
Revision
7ae6cf9d3f88e07b3fee0fecdb6822389e6c74c1 7ae6cf9d3f88e07b3fee0fecdb6822389e6c74c1
Failing since
#8 (Child of JB-GDB304-9)

No failed tests found, a possible compilation error occurred.

Responsible

This build has been failing since #8
No one has taken responsibility

Code commits

Author Commit Message Commit date
Mateusz Warowny <mmzwarowny@dundee.ac.uk> Mateusz Warowny <mmzwarowny@dundee.ac.uk> 7ae6cf9d3f88e07b3fee0fecdb6822389e6c74c1 7ae6cf9d3f88e07b3fee0fecdb6822389e6c74c1 JAL-3878 Create proper menu for interactive services.
Mateusz Warowny <mmzwarowny@dundee.ac.uk> Mateusz Warowny <mmzwarowny@dundee.ac.uk> 753bf06169312d77bfde25bad81f87511abe072a 753bf06169312d77bfde25bad81f87511abe072a JAL-3878 Add methods to get and remove workers by their calc name.

JIRA issues

IssueDescriptionStatus
Unknown Issue TypeJAL-3878Could not obtain issue details from JIRA

Shared artifacts

Artifact File size
Jalview executables 43 MB
getdown-channel 46 MB
Jalview getdown launcher 2 MB

Error summary for Default Job

The job generated some errors, drill down into the full build log for more details.

Note: Some input files use or override a deprecated API.
Note: Recompile with -Xlint:deprecation for details.
Note: Some input files use unchecked or unsafe operations.
Note: Recompile with -Xlint:unchecked for details.
2021/10/21 16:00:45:476 WARNING Starting without install4j classes
2021/10/21 16:00:46:036 WARNING Starting without install4j classes
        ^
  symbol:   class var
  location: class AnnotationOperation
/srv/bamboo/bamboo-home/xml-data/build-dir/196609/JB-GPC262-JOB1/src/jalview/ws2/operations/AnnotationOperation.java:215: error: cannot find symbol
                var worker = createWorker(arguments, frame, calcManager);
                ^
  symbol:   class var
  location: class AnnotationOperation
/srv/bamboo/bamboo-home/xml-data/build-dir/196609/JB-GPC262-JOB1/src/jalview/ws2/operations/AnnotationOperation.java:222: error: cannot find symbol
    final var editItem = _editItem;
          ^
  symbol:   class var
  location: class AnnotationOperation
/srv/bamboo/bamboo-home/xml-data/build-dir/196609/JB-GPC262-JOB1/src/jalview/ws2/operations/AnnotationOperation.java:229: error: cannot find symbol
          var isNuc = frame.getViewport().getAlignment().isNucleotide();
          ^
  symbol: class var
/srv/bamboo/bamboo-home/xml-data/build-dir/196609/JB-GPC262-JOB1/src/jalview/ws2/operations/AnnotationOperation.java:230: error: cannot find symbol
          var menuEnabled = (isNuc && isNucleotideOperation()) ||
          ^
  symbol: class var
/srv/bamboo/bamboo-home/xml-data/build-dir/196609/JB-GPC262-JOB1/src/jalview/ws2/operations/AnnotationOperation.java:273: error: cannot find symbol
    var stage = jobParams.showRunDialog();
    ^
  symbol:   class var
  location: class AnnotationOperation
/srv/bamboo/bamboo-home/xml-data/build-dir/196609/JB-GPC262-JOB1/src/jalview/ws2/operations/AlignmentOperation.java:155: error: cannot find symbol
      var alignSubmenu = new JMenu(service.getName());
      ^
  symbol:   class var
  location: class AlignmentOperation
/srv/bamboo/bamboo-home/xml-data/build-dir/196609/JB-GPC262-JOB1/src/jalview/ws2/operations/AlignmentOperation.java:158: error: cannot find symbol
      var realignSubmenu = new JMenu(MessageManager.formatMessage(
      ^
  symbol:   class var
  location: class AlignmentOperation
/srv/bamboo/bamboo-home/xml-data/build-dir/196609/JB-GPC262-JOB1/src/jalview/ws2/operations/AlignmentOperation.java:175: error: cannot find symbol
    final var calcName = service.getName();
          ^
  symbol:   class var
  location: class AlignmentOperation
/srv/bamboo/bamboo-home/xml-data/build-dir/196609/JB-GPC262-JOB1/src/jalview/ws2/operations/AlignmentOperation.java:180: error: cannot find symbol
      var item = new JMenuItem(MessageManager.formatMessage(
      ^
  symbol:   class var
  location: class AlignmentOperation
/srv/bamboo/bamboo-home/xml-data/build-dir/196609/JB-GPC262-JOB1/src/jalview/ws2/operations/AlignmentOperation.java:201: error: cannot find symbol
      var item = new JMenuItem(
      ^
  symbol:   class var
  location: class AlignmentOperation
/srv/bamboo/bamboo-home/xml-data/build-dir/196609/JB-GPC262-JOB1/src/jalview/ws2/operations/AlignmentOperation.java:226: error: cannot find symbol
    var presets = service.getParamStore().getPresets();
    ^
  symbol:   class var
  location: class AlignmentOperation
/srv/bamboo/bamboo-home/xml-data/build-dir/196609/JB-GPC262-JOB1/src/jalview/ws2/operations/AlignmentOperation.java:229: error: cannot find symbol
      final var presetList = new JMenu(MessageManager
            ^
  symbol:   class var
  location: class AlignmentOperation
/srv/bamboo/bamboo-home/xml-data/build-dir/196609/JB-GPC262-JOB1/src/jalview/ws2/operations/AlignmentOperation.java:231: error: cannot find symbol
      final var showToolTipFor = ToolTipManager.sharedInstance()
            ^
  symbol:   class var
  location: class AlignmentOperation
/srv/bamboo/bamboo-home/xml-data/build-dir/196609/JB-GPC262-JOB1/src/jalview/ws2/operations/AlignmentOperation.java:233: error: cannot find symbol
      for (final var preset : presets)
                 ^
  symbol:   class var
  location: class AlignmentOperation
/srv/bamboo/bamboo-home/xml-data/build-dir/196609/JB-GPC262-JOB1/src/jalview/ws2/operations/AlignmentOperation.java:235: error: cannot find symbol
        var item = new JMenuItem(preset.getName());
        ^
  symbol:   class var
  location: class AlignmentOperation
/srv/bamboo/bamboo-home/xml-data/build-dir/196609/JB-GPC262-JOB1/src/jalview/ws2/operations/AlignmentOperation.java:287: error: cannot find symbol
    var stage = jobParams.showRunDialog();
    ^
  symbol:   class var
  location: class AlignmentOperation
Note: Some input files use or override a deprecated API.
Note: Recompile with -Xlint:deprecation for details.
Note: Some input files use unchecked or unsafe operations.
Note: Recompile with -Xlint:unchecked for details.
100 errors
100 warnings

FAILURE: Build failed with an exception.

* What went wrong:
Execution failed for task ':compileJava'.
> Compilation failed; see the compiler error output for details.

* Try:
Run with --stacktrace option to get the stack trace. Run with --info or --debug option to get more log output. Run with --scan to get full insights.

* Get more help at https://help.gradle.org

BUILD FAILED in 6s