Build #95

Build and run tests under Java 11

Build: #95 failed Manual run by Jim Procter

Stages & jobs

  1. Default Stage

  2. Snapshot build

Build result summary

Details

Completed
Duration
5 minutes
Labels
None
Agent
Default Agent
Revision
140c8de58b9a30d013e7fcc3904df91fa81880fc 140c8de58b9a30d013e7fcc3904df91fa81880fc
Total tests
1289
Failing since
#94 (Manual run by Jim Procter)

Responsible

This build has been failing since #94
No one has taken responsibility

Tests

Existing test failures 5
Status Test Failing since View job Duration
Classname: java.lang.NullPointerException
Message: null
Stacktrace:
java.lang.NullPointerException
	at jalview.analysis.CrossRefTest.testFindXrefSequences_forGeneAndTranscripts(CrossRefTest.java:535)
	at java.base/jdk.internal.reflect.NativeMethodAccessorImpl.invoke0(Native Method)
	at java.base/jdk.internal.reflect.NativeMethodAccessorImpl.invoke(NativeMethodAccessorImpl.java:62)
	at java.base/jdk.internal.reflect.DelegatingMethodAccessorImpl.invoke(DelegatingMethodAccessorImpl.java:43)
(46 more lines...)
Classname: java.lang.NullPointerException
Message: null
Stacktrace:
java.lang.NullPointerException
	at jalview.analysis.CrossRefTest.testFindXrefSequences_withFetch(CrossRefTest.java:452)
	at java.base/jdk.internal.reflect.NativeMethodAccessorImpl.invoke0(Native Method)
	at java.base/jdk.internal.reflect.NativeMethodAccessorImpl.invoke(NativeMethodAccessorImpl.java:62)
	at java.base/jdk.internal.reflect.DelegatingMethodAccessorImpl.invoke(DelegatingMethodAccessorImpl.java:43)
(46 more lines...)
Classname: java.lang.NullPointerException
Message: null
Stacktrace:
java.lang.NullPointerException
	at jalview.analysis.CrossRefTest.testFindXrefSequences_uniprotEmblManyToMany(CrossRefTest.java:711)
	at java.base/jdk.internal.reflect.NativeMethodAccessorImpl.invoke0(Native Method)
	at java.base/jdk.internal.reflect.NativeMethodAccessorImpl.invoke(NativeMethodAccessorImpl.java:62)
	at java.base/jdk.internal.reflect.DelegatingMethodAccessorImpl.invoke(DelegatingMethodAccessorImpl.java:43)
(46 more lines...)
Classname: java.lang.AssertionError
Message: Failed command : -nousagestats expected [true] but found [false]
Stacktrace:
java.lang.AssertionError: Failed command : -nousagestats expected [true] but found [false]
	at org.testng.Assert.fail(Assert.java:94)
	at org.testng.Assert.failNotEquals(Assert.java:496)
	at org.testng.Assert.assertTrue(Assert.java:42)
	at jalview.bin.CommandLineOperations.testAllInputOperations(CommandLineOperations.java:273)
(49 more lines...)
Classname: java.lang.AssertionError
Message: Failed command : -noquestionnaire expected [true] but found [false]
Stacktrace:
java.lang.AssertionError: Failed command : -noquestionnaire expected [true] but found [false]
	at org.testng.Assert.fail(Assert.java:94)
	at org.testng.Assert.failNotEquals(Assert.java:496)
	at org.testng.Assert.assertTrue(Assert.java:42)
	at jalview.bin.CommandLineOperations.testAllInputOperations(CommandLineOperations.java:273)
(49 more lines...)