Build #25

Build and run tests under Java 11

Build: #25 failed Changes by Jim Procter

Build result summary

Details

Completed
Duration
3 minutes
Labels
None
Agent
Default Agent
Revision
3d1e4d899ac0fd09bcdf469c1e049be8eaa4fb8e 3d1e4d899ac0fd09bcdf469c1e049be8eaa4fb8e
Total tests
1287

Responsible

No one has taken responsibility for this failure

Code commits

Author Commit Message Commit date
Jim Procter Jim Procter 3d1e4d899ac0fd09bcdf469c1e049be8eaa4fb8e 3d1e4d899ac0fd09bcdf469c1e049be8eaa4fb8e Merge branch 'task/JAL-3247_Install4j_improvements' into develop
Ben Soares Ben Soares 0142e5efd4ab56595498583539448b79b27ae728 m 0142e5efd4ab56595498583539448b79b27ae728 Merge branch 'task/JAL-3236_install4j_linux_unix_userland_installers' into task/JAL-3247_Install4j_improvements
Ben Soares Ben Soares efdba96b70db9305d3d0a6a711d5e6690c3cad90 m efdba96b70db9305d3d0a6a711d5e6690c3cad90 JAL-3247 nogradle option on this mac build/install helper script
Ben Soares Ben Soares f82b6b6251f9cc35180881d4e5d7e48ca1783783 m f82b6b6251f9cc35180881d4e5d7e48ca1783783 JAL-3247 JAL-3254 JAL-3260 Fixed: JVL file jalview.apparg args. File association problem in Windows NETWORK installer.

Tests

New test failures 2
Status Test View job Duration
Collapse Failed SeqPanelTest testFindMousePosition_wrapped_annotations History
Default Job < 1 sec
Classname: java.lang.AssertionError
Message: expected [14] but found [3]
Stacktrace:
java.lang.AssertionError: expected [14] but found [3]
	at org.testng.Assert.fail(Assert.java:94)
	at org.testng.Assert.failNotEquals(Assert.java:496)
	at org.testng.Assert.assertEquals(Assert.java:125)
	at org.testng.Assert.assertEquals(Assert.java:372)
(51 more lines...)
Collapse Failed SeqPanelTest testFindMousePosition_wrapped_scaleAbove History
Default Job < 1 sec
Classname: java.lang.AssertionError
Message: expected [3] but found [-1]
Stacktrace:
java.lang.AssertionError: expected [3] but found [-1]
	at org.testng.Assert.fail(Assert.java:94)
	at org.testng.Assert.failNotEquals(Assert.java:496)
	at org.testng.Assert.assertEquals(Assert.java:125)
	at org.testng.Assert.assertEquals(Assert.java:372)
(51 more lines...)
Existing test failures 4
Status Test Failing since View job Duration
Classname: java.lang.NullPointerException
Message: null
Stacktrace:
java.lang.NullPointerException
	at jalview.analysis.CrossRefTest.testFindXrefSequences_forGeneAndTranscripts(CrossRefTest.java:535)
	at java.base/jdk.internal.reflect.NativeMethodAccessorImpl.invoke0(Native Method)
	at java.base/jdk.internal.reflect.NativeMethodAccessorImpl.invoke(NativeMethodAccessorImpl.java:62)
	at java.base/jdk.internal.reflect.DelegatingMethodAccessorImpl.invoke(DelegatingMethodAccessorImpl.java:43)
(46 more lines...)
Classname: java.lang.NullPointerException
Message: null
Stacktrace:
java.lang.NullPointerException
	at jalview.analysis.CrossRefTest.testFindXrefSequences_withFetch(CrossRefTest.java:452)
	at java.base/jdk.internal.reflect.NativeMethodAccessorImpl.invoke0(Native Method)
	at java.base/jdk.internal.reflect.NativeMethodAccessorImpl.invoke(NativeMethodAccessorImpl.java:62)
	at java.base/jdk.internal.reflect.DelegatingMethodAccessorImpl.invoke(DelegatingMethodAccessorImpl.java:43)
(46 more lines...)
Classname: java.lang.NullPointerException
Message: null
Stacktrace:
java.lang.NullPointerException
	at jalview.analysis.CrossRefTest.testFindXrefSequences_uniprotEmblManyToMany(CrossRefTest.java:711)
	at java.base/jdk.internal.reflect.NativeMethodAccessorImpl.invoke0(Native Method)
	at java.base/jdk.internal.reflect.NativeMethodAccessorImpl.invoke(NativeMethodAccessorImpl.java:62)
	at java.base/jdk.internal.reflect.DelegatingMethodAccessorImpl.invoke(DelegatingMethodAccessorImpl.java:43)
(46 more lines...)
Classname: java.lang.AssertionError
Message: expected [42] but found [59]
Stacktrace:
java.lang.AssertionError: expected [42] but found [59]
	at org.testng.Assert.fail(Assert.java:94)
	at org.testng.Assert.failNotEquals(Assert.java:496)
	at org.testng.Assert.assertEquals(Assert.java:125)
	at org.testng.Assert.assertEquals(Assert.java:372)
(51 more lines...)

JIRA issues

IssueDescriptionStatus
Unknown Issue TypeJAL-3236Could not obtain issue details from JIRA
Unknown Issue TypeJAL-3247Could not obtain issue details from JIRA
Unknown Issue TypeJAL-3254Could not obtain issue details from JIRA
Unknown Issue TypeJAL-3260Could not obtain issue details from JIRA