Build #113

Build and run tests under Java 11

Build: #113 failed Changes by Ben Soares

Build result summary

Details

Completed
Duration
3 minutes
Labels
None
Agent
Default Agent
Revision
6907f4fb0b389eb4110cdc6505e08ffc6f614780 6907f4fb0b389eb4110cdc6505e08ffc6f614780
Total tests
1286

Responsible

Code commits

Author Commit Message Commit date
Ben Soares Ben Soares 6907f4fb0b389eb4110cdc6505e08ffc6f614780 6907f4fb0b389eb4110cdc6505e08ffc6f614780 JAL-3473 Checked value of def and min. Set def to min if lower than min.

Tests

Existing test failures 2
Status Test Failing since View job Duration
Classname: java.lang.AssertionError
Message: Failed command : -noquestionnaire expected [true] but found [false]
Stacktrace:
java.lang.AssertionError: Failed command : -noquestionnaire expected [true] but found [false]
	at org.testng.Assert.fail(Assert.java:94)
	at org.testng.Assert.failNotEquals(Assert.java:496)
	at org.testng.Assert.assertTrue(Assert.java:42)
	at jalview.bin.CommandLineOperations.testAllInputOperations(CommandLineOperations.java:273)
(49 more lines...)
Classname: java.lang.AssertionError
Message: Failed command : -nousagestats expected [true] but found [false]
Stacktrace:
java.lang.AssertionError: Failed command : -nousagestats expected [true] but found [false]
	at org.testng.Assert.fail(Assert.java:94)
	at org.testng.Assert.failNotEquals(Assert.java:496)
	at org.testng.Assert.assertTrue(Assert.java:42)
	at jalview.bin.CommandLineOperations.testAllInputOperations(CommandLineOperations.java:273)
(49 more lines...)

JIRA issues

IssueDescriptionStatus
Unknown Issue TypeJAL-3473Could not obtain issue details from JIRA